BDBM123674 US8748618, AI-4-48
SMILES FC(F)(F)c1cc(Cl)c2[nH]c(nc2c1)-c1ccccn1
InChI Key InChIKey=IVOJGCYAJQQAPS-UHFFFAOYSA-N
Data  1 IC50
  Tab Delimited (TSV)   2D SDfile   Computed 3D by Vconf -m prep SDfile
Find this compound or compounds like it in BindingDB:
Activity Spreadsheet -- Enzyme Inhibition Constant Data from BindingDB
Found 1 hit for monomerid = 123674
TargetCore-binding factor subunit beta(Homo sapiens (Human))
University Of Virginia Patent Foundation
US Patent
LigandPNGBDBM123674(US8748618, AI-4-48)
Affinity DataIC50:  760nM. Assay description: We have developed effective assays to monitor the inhibition of CBFβ-SMMHC binding to the Runt domain (as well as for CBFβ binding to the R...
Ligand InfoPC cidPC sid
In DepthDetails US Patent