BDBM123695 US8741915, 65
SMILES CCOc1cc(cc(c1O)N(=O)=O)C1NC(=O)N=C(C1c1ccccc1)c1cccnc1
InChI Key InChIKey=ADNUWBLFRFEGIQ-UHFFFAOYSA-N
Data  1 IC50
  Tab Delimited (TSV)   2D SDfile   Computed 3D by Vconf -m prep SDfile
Find this compound or compounds like it in BindingDB:
Activity Spreadsheet -- Enzyme Inhibition Constant Data from BindingDB
Found 1 hit for monomerid = 123695
TargetAlcohol dehydrogenase class-3(Homo sapiens (Human))
N30 Pharmaceuticals
US Patent
LigandPNGBDBM123695(US8741915, 65)
Affinity DataIC50:  43nMpH: 7.4 T: 2°C. Assay description: GSNO and Enzyme/NADH Solutions are made up fresh each day. The Solutions are filtered and allowed to warm to room temperature. GSNO Solution: 100 mM ...
In DepthDetails US Patent