BDBM123705 US8741915, 147
SMILES CCOc1cc(cc(C(O)=O)c1O)[C@H]1NC(=O)N=C(C1c1ccsc1)c1cnn(C)c1
InChI Key InChIKey=DPYAPXGKXDSLIM-ZYMOGRSISA-N
Data  1 IC50
  Tab Delimited (TSV)   2D SDfile   Computed 3D by Vconf -m prep SDfile
Find this compound or compounds like it in BindingDB:
Activity Spreadsheet -- Enzyme Inhibition Constant Data from BindingDB
Found 1 hit for monomerid = 123705
TargetAlcohol dehydrogenase class-3(Homo sapiens (Human))
N30 Pharmaceuticals
US Patent
LigandPNGBDBM123705(US8741915, 147)
Affinity DataIC50:  580nMpH: 7.4 T: 2°C. Assay description: GSNO and Enzyme/NADH Solutions are made up fresh each day. The Solutions are filtered and allowed to warm to room temperature. GSNO Solution: 100 mM ...
In DepthDetails US Patent