BDBM123925 US8754233, [2-(3-Amino-5-methyl-1H-pyrazol-4-yl)-5-fluoro-benzothiazol-6-yl]-methanol
SMILES Cc1[nH]nc(N)c1-c1nc2cc(F)c(CO)cc2s1
InChI Key InChIKey=IIKBSVJXNRIRLB-UHFFFAOYSA-N
Data  1 IC50
  Tab Delimited (TSV)   2D SDfile   Computed 3D by Vconf -m prep SDfile
Find this compound or compounds like it in BindingDB:
Activity Spreadsheet -- Enzyme Inhibition Constant Data from BindingDB
Found 1 hit for monomerid = 123925
TargetIntegrin-linked protein kinase(Homo sapiens (Human))
Dermira (Canada)
US Patent
LigandPNGBDBM123925(US8754233, [2-(3-Amino-5-methyl-1H-pyrazol-4-yl)-5...)
Affinity DataIC50:  100nMT: 2°C. Assay description: 5 uL of each compound dilution were robotically pipetted to Costar serocluster plates maintaining the same plate layout. All assay mixtures consisted...
In DepthDetails US Patent