BDBM124005 US8754233, 4-(6-Bromo-benzothiazol-2-yl)-5-methyl-1H-pyrazol-3-ylamine
SMILES Cc1[nH]nc(N)c1-c1nc2ccc(Br)cc2s1
InChI Key InChIKey=KAMNFXYPIHJODD-UHFFFAOYSA-N
Data  1 IC50
  Tab Delimited (TSV)   2D SDfile   Computed 3D by Vconf -m prep SDfile
Find this compound or compounds like it in BindingDB:
Activity Spreadsheet -- Enzyme Inhibition Constant Data from BindingDB
Found 1 hit for monomerid = 124005
TargetIntegrin-linked protein kinase(Homo sapiens (Human))
Dermira (Canada)
US Patent
LigandPNGBDBM124005(US8754233, 4-(6-Bromo-benzothiazol-2-yl)-5-methyl-...)
Affinity DataIC50:  400nMT: 2°C. Assay description: 5 uL of each compound dilution were robotically pipetted to Costar serocluster plates maintaining the same plate layout. All assay mixtures consisted...
In DepthDetails US Patent