BDBM124023 US8754233, 4-Benzothiazol-2-yl-5-(4-dimethylamino-butyl)-2H-pyrazol-3-ylamine
SMILES CN(C)CCCCc1[nH]nc(N)c1-c1nc2ccccc2s1
InChI Key InChIKey=UCAFAKHXNWXJNO-UHFFFAOYSA-N
Data  1 IC50
  Tab Delimited (TSV)   2D SDfile   Computed 3D by Vconf -m prep SDfile
Find this compound or compounds like it in BindingDB:
Activity Spreadsheet -- Enzyme Inhibition Constant Data from BindingDB
Found 1 hit for monomerid = 124023
TargetIntegrin-linked protein kinase(Homo sapiens (Human))
Dermira (Canada)
US Patent
LigandPNGBDBM124023(US8754233, 4-Benzothiazol-2-yl-5-(4-dimethylamino-...)
Affinity DataIC50:  400nMT: 2°C. Assay description: 5 uL of each compound dilution were robotically pipetted to Costar serocluster plates maintaining the same plate layout. All assay mixtures consisted...
In DepthDetails US Patent