BDBM124038 US8754233, 4-Benzothiazol-2-yl-N3-(1H-imidazol-2-ylmethyl)-1H-pyrazole-3,5-diamine
SMILES Nc1n[nH]c(NCc2ncc[nH]2)c1-c1nc2ccccc2s1
InChI Key InChIKey=ARAKKJMWIDLLLO-UHFFFAOYSA-N
Data  1 IC50
  Tab Delimited (TSV)   2D SDfile   Computed 3D by Vconf -m prep SDfile
Find this compound or compounds like it in BindingDB:
Activity Spreadsheet -- Enzyme Inhibition Constant Data from BindingDB
Found 1 hit for monomerid = 124038
TargetIntegrin-linked protein kinase(Homo sapiens (Human))
Dermira (Canada)
US Patent
LigandPNGBDBM124038(US8754233, 4-Benzothiazol-2-yl-N3-(1H-imidazol-2-y...)
Affinity DataIC50:  2.50E+3nMT: 2°C. Assay description: 5 uL of each compound dilution were robotically pipetted to Costar serocluster plates maintaining the same plate layout. All assay mixtures consisted...
In DepthDetails US Patent