BDBM124137 US8754075, 7
SMILES C[C@@]1(N=C(N)OC[C@@H]1F)c1cc(NC(=O)c2ncc(cc2Cl)C#N)ccc1F
InChI Key InChIKey=KYSGVAXATOXFCB-KBXCAEBGSA-N
Data  2 IC50
  Tab Delimited (TSV)   2D SDfile   Computed 3D by Vconf -m prep SDfile
Find this compound or compounds like it in BindingDB:
Activity Spreadsheet -- Enzyme Inhibition Constant Data from BindingDB
Found 2 hits for monomerid = 124137
TargetBeta-secretase 2(Homo sapiens (Human))
Hoffmann-La Roche
US Patent
LigandPNGBDBM124137(US8754075, 7)
Affinity DataIC50:  10nMT: 2°C. Assay description: The assay uses the principle of inhibition of human TMEM27 cleavage by endogenous cellular BACE2 in the Ins1e rat cell line and shedding from the cel...
In DepthDetails US Patent
TargetBeta-secretase 1(Homo sapiens (Human))
Hoffmann-La Roche
US Patent
LigandPNGBDBM124137(US8754075, 7)
Affinity DataIC50:  2nMT: 2°C. Assay description: The assay uses the principle of inhibition of human TMEM27 cleavage by endogenous cellular BACE2 in the Ins1e rat cell line and shedding from the cel...
In DepthDetails US Patent