BDBM124149 US8754075, 19
SMILES C[C@@]1(N=C(N)OC[C@@H]1F)c1cc(NC(=O)c2cnc(OCC(F)F)cn2)ccc1F
InChI Key InChIKey=YUDVJPZQJRMSDK-SCLBCKFNSA-N
Data  1 IC50
  Tab Delimited (TSV)   2D SDfile   Computed 3D by Vconf -m prep SDfile
Find this compound or compounds like it in BindingDB:
Activity Spreadsheet -- Enzyme Inhibition Constant Data from BindingDB
Found 1 hit for monomerid = 124149
TargetBeta-secretase 1(Homo sapiens (Human))
Hoffmann-La Roche
US Patent
LigandPNGBDBM124149(US8754075, 19)
Affinity DataIC50:  8nMT: 2°C. Assay description: The assay uses the principle of inhibition of human TMEM27 cleavage by endogenous cellular BACE2 in the Ins1e rat cell line and shedding from the cel...
In DepthDetails US Patent