BDBM124306 US8759537, 43
SMILES Cn1c(Nc2c(Cl)ccc(CNC(=O)C(C)(C)C)c2Cl)nc2cc(C(=O)NCC(F)F)c(OCC(F)F)cc12
InChI Key InChIKey=RMTPLSINCGOQFF-UHFFFAOYSA-N
Data  1 IC50
  Tab Delimited (TSV)   2D SDfile   Computed 3D by Vconf -m prep SDfile
Find this compound or compounds like it in BindingDB:
Activity Spreadsheet -- Enzyme Inhibition Constant Data from BindingDB
Found 1 hit for monomerid = 124306
TargetProstaglandin E synthase(Homo sapiens (Human))
Boehringer Ingelheim International
US Patent
LigandPNGBDBM124306(US8759537, 43)
Affinity DataIC50:  4nMpH: 7.4 T: 2°C. Assay description: The aim of this assay is to determine the affinity of a test compound for the mPGES-1 enzyme. 47 ul of recombinant human mPGES-1 (0.5 ug protein/wel...
In DepthDetails US Patent