BDBM124522 US8759532, 199
SMILES CC(=O)N1CCCC[C@@H]1c1cccnc1Oc1ccc(cc1)C(=O)c1nc2ccccc2[nH]1
InChI Key InChIKey=ICIHBPSATJABEV-HSZRJFAPSA-N
Data  1 IC50
  Tab Delimited (TSV)   2D SDfile   Computed 3D by Vconf -m prep SDfile
Find this compound or compounds like it in BindingDB:
Activity Spreadsheet -- Enzyme Inhibition Constant Data from BindingDB
Found 1 hit for monomerid = 124522
TargetcAMP and cAMP-inhibited cGMP 3',5'-cyclic phosphodiesterase 10A(Homo sapiens (Human))
Amgen
US Patent
LigandPNGBDBM124522(US8759532, 199)
Affinity DataIC50:  0.0645nMT: 2°C. Assay description: To check the inhibition profile, 5 μL of serial diluted compounds were incubated with 5 μL of diluted PDE10 enzyme (BPS Bioscience, San Die...
Ligand InfoPC cidPC sid
In DepthDetails US Patent