BDBM124600 US8759532, 284
SMILES O=C1CC[C@H](C1)c1cccnc1Oc1ccc(Nc2nc3ccccc3s2)cc1
InChI Key InChIKey=BTRKUPPYXBYVGG-OAHLLOKOSA-N
Data  1 IC50
  Tab Delimited (TSV)   2D SDfile   Computed 3D by Vconf -m prep SDfile
Find this compound or compounds like it in BindingDB:
Activity Spreadsheet -- Enzyme Inhibition Constant Data from BindingDB
Found 1 hit for monomerid = 124600
TargetcAMP and cAMP-inhibited cGMP 3',5'-cyclic phosphodiesterase 10A(Homo sapiens (Human))
Amgen
US Patent
LigandPNGBDBM124600(US8759532, 284)
Affinity DataIC50:  0.169nMT: 2°C. Assay description: To check the inhibition profile, 5 μL of serial diluted compounds were incubated with 5 μL of diluted PDE10 enzyme (BPS Bioscience, San Die...
In DepthDetails US Patent