BDBM124655 US8759366, 1-{Cis-4-hydroxy-4-[5-(3-methyl-5-{[4-(trifluoromethyl)pyrimidin-2-yl]amino}-phenyl)-1,3-thiazol-2-yl]cyclohexyl}pyrrolidin-2-one
SMILES Cc1cc(Nc2nccc(n2)C(F)(F)F)cc(c1)-c1cnc(s1)C1(O)CCC(CC1)N1CCCC1=O
InChI Key InChIKey=WYAJKHYUOOUXPQ-UHFFFAOYSA-N
Data  1 IC50
  Tab Delimited (TSV)   2D SDfile   Computed 3D by Vconf -m prep SDfile
Find this compound or compounds like it in BindingDB:
Activity Spreadsheet -- Enzyme Inhibition Constant Data from BindingDB
Found 1 hit for monomerid = 124655
TargetTyrosine-protein kinase SYK(Homo sapiens (Human))
Merck Sharp & Dohme
US Patent
LigandPNGBDBM124655(US8759366, 1-{Cis-4-hydroxy-4-[5-(3-methyl-5-{[4-(...)
Affinity DataIC50:  4nMpH: 7.5 T: 2°C. Assay description: A recombinant GST-hSYK fusion protein was used to measure potency of compounds to inhibit human SYK activity. The recombinant human GST-SYK (Carna Bi...
In DepthDetails US Patent