BDBM124781 US8765940, 1-(7-fluoro-3-methyl-2-(2-pyridinyl)-4-quinolinyl)-6-(4-morpholinyl)-1,2,2',3',5',6'-hexahydrospiro[indole-3,4'-thiopyran]-1',1'-dioxide
SMILES Cc1c(nc2cc(F)ccc2c1N1CC2(CCS(=O)(=O)CC2)c2ccc(cc12)N1CCOCC1)-c1ccccn1
InChI Key InChIKey=KILCNCDDYMFDOD-UHFFFAOYSA-N
Data  1 KI
  Tab Delimited (TSV)   2D SDfile   Computed 3D by Vconf -m prep SDfile
Find this compound or compounds like it in BindingDB:
Activity Spreadsheet -- Enzyme Inhibition Constant Data from BindingDB
Found 1 hit for monomerid = 124781
LigandPNGBDBM124781(US8765940, 1-(7-fluoro-3-methyl-2-(2-pyridinyl)-4-...)
Affinity DataKi:  1.37nMpH: 7.0Assay Description:A PI3K Alphascreen assay (PerkinElmer, Waltham, Mass.) was used to measure the activity of a panel of four phosphoinositide 3-kinases: PI3Kα, PI...
In DepthDetails US Patent