BDBM125138 US8765744, 87
SMILES C[C@H](N1CCC2(CCC(=O)CC2)OC1=O)c1ccccc1
InChI Key InChIKey=PCQDJWBIQSHTOO-ZDUSSCGKSA-N
Data  1 IC50
  Tab Delimited (TSV)   2D SDfile   Computed 3D by Vconf -m prep SDfile
Find this compound or compounds like it in BindingDB:
Activity Spreadsheet -- Enzyme Inhibition Constant Data from BindingDB
Found 1 hit for monomerid = 125138
Target11-beta-hydroxysteroid dehydrogenase 1(Homo sapiens (Human))
Boehringer Ingelheim International
US Patent
LigandPNGBDBM125138(US8765744, 87)
Affinity DataIC50:  745nMpH: 6.0Assay Description:In vitro inhibition of 11beta -HSD1 by test compounds is determined with HTRF (Homogeneous Time-Resolved Fluorescence) technology (cisbio internation...
In DepthDetails US Patent