BDBM125444 US8772480, 299
SMILES COc1ncc(Nc2ncc(cc2-c2nc(C)nc(N)n2)C(C)NC(C)C)cc1F
InChI Key InChIKey=DTSKLDGTCGXHQT-UHFFFAOYSA-N
Data  1 KI  1 IC50
  Tab Delimited (TSV)   2D SDfile   Computed 3D by Vconf -m prep SDfile
Find this compound or compounds like it in BindingDB:
Activity Spreadsheet -- Enzyme Inhibition Constant Data from BindingDB
Found 2 hits for monomerid = 125444
LigandPNGBDBM125444(US8772480, 299)
Affinity DataKi:  61nM. Assay description: The PI3K AlphaScreen assay (PerkinElmer, Waltham, Mass.) measures the activity of a panel of four phosphoinositide 3-kinases: PI3Kalpha, PI3Kbeta, PI...
In DepthDetails US Patent
TargetSerine/threonine-protein kinase mTOR(Homo sapiens (Human))
Amgen
US Patent
LigandPNGBDBM125444(US8772480, 299)
Affinity DataIC50: >1.00E+4nM. Assay description: The Invitrogen (Carlsbad, Calif.) mammalian target of rapamycin (mTOR) Lanthascreen assay can be used to quantitate mTOR kinase activity in an in vit...
In DepthDetails US Patent