BDBM12557 6-chloro-N-[(3S)-2-oxo-1-[(2S)-1-oxo-1-(piperidin-1-yl)propan-2-yl]pyrrolidin-3-yl]naphthalene-2-sulfonamide::pyrrolidin-2-one-based inhibitor 5
SMILES C[C@H](N1CC[C@H](NS(=O)(=O)c2ccc3cc(Cl)ccc3c2)C1=O)C(=O)N1CCCCC1
InChI Key InChIKey=RFBGMIUDFJBOHN-YWZLYKJASA-N
Data  1 KI
  Tab Delimited (TSV)   2D SDfile   Computed 3D by Vconf -m prep SDfile
Find this compound or compounds like it in BindingDB:
Activity Spreadsheet -- Enzyme Inhibition Constant Data from BindingDB
Found 1 hit for monomerid = 12557
TargetCoagulation factor X(Homo sapiens (Human))
Glaxosmithkline
LigandPNGBDBM12557(6-chloro-N-[(3S)-2-oxo-1-[(2S)-1-oxo-1-(piperidin-...)
Affinity DataKi:  1nM ΔG°:  -12.3kcal/molepH: 7.8 T: 2°C. Assay description: The inhibitory effect of test compound for human fXa was determined by using the chromogenic substrate. The hydrolysis rates of chromogenic substrate...
In DepthDetails ArticlePubMed