BDBM125769 US8772305, 164
SMILES CN(Cc1cncn1C)C(=O)c1cc2cc(Nc3nccc(n3)-c3ccccn3)ccc2[nH]1
InChI Key InChIKey=MBVCMQJSHGVCFQ-UHFFFAOYSA-N
Data  1 IC50
  Tab Delimited (TSV)   2D SDfile   Computed 3D by Vconf -m prep SDfile
Find this compound or compounds like it in BindingDB:
Activity Spreadsheet -- Enzyme Inhibition Constant Data from BindingDB
Found 1 hit for monomerid = 125769
TargetTyrosine-protein kinase SYK(Homo sapiens (Human))
Boehringer Ingelheim International
US Patent
LigandPNGBDBM125769(US8772305, 164)
Affinity DataIC50:  18.3nMpH: 7.5 T: 2°C. Assay description: Recombinant human Syk (amino acids 342-635) was expressed as a fusion protein with an N-terminal GST tag, affinity-purified and deep-frozen at a conc...
In DepthDetails US Patent