BDBM126582 US8772283, 26
SMILES Cc1ccc2-c3nc(c(-c4ccccc4)n3COc2c1)-c1ccc(cc1)C1(N)CC(O)(C1)C1CC1
InChI Key InChIKey=FKOOFFGUXHNLNF-UHFFFAOYSA-N
Data  2 IC50
  Tab Delimited (TSV)   2D SDfile   Computed 3D by Vconf -m prep SDfile
Find this compound or compounds like it in BindingDB:
Activity Spreadsheet -- Enzyme Inhibition Constant Data from BindingDB
Found 2 hits for monomerid = 126582
TargetRAC-beta serine/threonine-protein kinase(Homo sapiens (Human))
Taiho Pharmaceutical
US Patent
LigandPNGBDBM126582(US8772283, 26)
Affinity DataIC50:  1.5nMpH: 7.5Assay Description:Preparation of AKT1 and AKT2 and measurement of in vitro inhibitory activity of the above-mentioned compounds against AKT1 and AKT2 kinase activity w...
In DepthDetails US Patent
TargetRAC-alpha serine/threonine-protein kinase(Homo sapiens (Human))
Taiho Pharmaceutical
US Patent
LigandPNGBDBM126582(US8772283, 26)
Affinity DataIC50:  26nMpH: 7.5Assay Description:Preparation of AKT1 and AKT2 and measurement of in vitro inhibitory activity of the above-mentioned compounds against AKT1 and AKT2 kinase activity w...
In DepthDetails US Patent