BDBM126626 US8785638, 107
SMILES CCCC(C(O)=O)c1c(C)nc2sc3CCCc3c2c1-c1ccccc1
InChI Key InChIKey=QCPYELZVIGYJGN-UHFFFAOYSA-N
Data  1 IC50
  Tab Delimited (TSV)   2D SDfile   Computed 3D by Vconf -m prep SDfile
Find this compound or compounds like it in BindingDB:
Activity Spreadsheet -- Enzyme Inhibition Constant Data from BindingDB
Found 1 hit for monomerid = 126626
TargetGag-Pol polyprotein(Human immunodeficiency virus type 1 (HIV-1))
Katholieke Universiteit Leuven
US Patent
LigandPNGBDBM126626(US8785638, 107)
Affinity DataIC50:  3.47E+4nMpH: 7.4 T: 2°C. Assay description: The AlphaScreen assay was performed according to the manufacturer's protocol (Perkin Elmer, Benelux). Reactions were performed in 25 ul final volume ...
In DepthDetails US Patent