BDBM12739 6-(4-{2-[(dimethylamino)methyl]phenyl}phenyl)-1-(4-ethylphenyl)-3-(trifluoromethyl)-1H,4H,5H,6H,7H-pyrazolo[3,4-c]pyridin-7-one::dihydropyrazolopyridinone analogue 6j
SMILES CCc1ccc(cc1)-n1nc(c2CCN(C(=O)c12)c1ccc(cc1)-c1ccccc1CN(C)C)C(F)(F)F
InChI Key InChIKey=JMGINPKJPSJGBU-UHFFFAOYSA-N
Data  1 KI
  Tab Delimited (TSV)   2D SDfile   Computed 3D by Vconf -m prep SDfile
Find this compound or compounds like it in BindingDB:
Activity Spreadsheet -- Enzyme Inhibition Constant Data from BindingDB
Found 1 hit for monomerid = 12739
TargetCoagulation factor X(Homo sapiens (Human))
Bristol-Myers Squibb Pharmaceutical Research Institute
LigandPNGBDBM12739(6-(4-{2-[(dimethylamino)methyl]phenyl}phenyl)-1-(4...)
Affinity DataKi:  2.60nM ΔG°:  -11.6kcal/molepH: 7.0 T: 2°C. Assay description: Ki values were obtained from human purified enzyme. All assays were run in microtiter plates. Plates were read for 30 min at 405 nm. Rates were deter...
In DepthDetails ArticlePubMed