BDBM127681 US8791123, 54
SMILES OCc1ccc(F)cc1C1CCCN1c1ccn2ncc(C(=O)NCCN3CCOCC3)c2n1
InChI Key InChIKey=IFTKTMZJBXEOCK-UHFFFAOYSA-N
Data  2 IC50
  Tab Delimited (TSV)   2D SDfile   Computed 3D by Vconf -m prep SDfile
Find this compound or compounds like it in BindingDB:
Activity Spreadsheet -- Enzyme Inhibition Constant Data from BindingDB
Found 2 hits for monomerid = 127681
TargetTyrosine-protein kinase JAK2(Homo sapiens (Human))
Array Biopharma
US Patent
LigandPNGBDBM127681(US8791123, 54)
Affinity DataIC50: >1.00E+3nM. Assay description: Compounds of Formula I were screened for their ability to inhibit Jak2 using the general enzyme inhibition assay method, in which the assay mixture c...
In DepthDetails US Patent
TargetHigh affinity nerve growth factor receptor(Homo sapiens (Human))
Array Biopharma
US Patent
LigandPNGBDBM127681(US8791123, 54)
Affinity DataIC50:  2.25nMpH: 7.5Assay Description:An enzyme-linked immunosorbant assay (ELISA) was used to assess TrkA kinase activity in the presence of inhibitors. Immulon 4HBX 384-well microtiter ...
In DepthDetails US Patent