BDBM127913 US8791130, 43
SMILES CNc1nc(Nc2cc(F)c(cc2OC)-c2cnnn2C)ncc1C(F)(F)F
InChI Key InChIKey=UOYVKICXNWXXOP-UHFFFAOYSA-N
Data  1 KI
  Tab Delimited (TSV)   2D SDfile   Computed 3D by Vconf -m prep SDfile
Find this compound or compounds like it in BindingDB:
Activity Spreadsheet -- Enzyme Inhibition Constant Data from BindingDB
Found 1 hit for monomerid = 127913
TargetLeucine-rich repeat serine/threonine-protein kinase 2(Homo sapiens (Human))
Genentech
US Patent
LigandPNGBDBM127913(US8791130, 43)
Affinity DataKi:  2nM. Assay description: This assay was used to determine a compound's potency in inhibiting activity of LRRK2 by determining, Kiapp, IC50, or percent inhibition values. ...
In DepthDetails US Patent