BDBM127955 US8796310, 4B
SMILES Cc1cc(Nc2cc(ccn2)C(F)(F)F)nc(c1)-c1cnc(s1)[C@]1(O)CCCc2cc(C(O)=O)c(F)cc12
InChI Key InChIKey=PNKAWGMVXIAEAY-VWLOTQADSA-N
Data  1 IC50
  Tab Delimited (TSV)   2D SDfile   Computed 3D by Vconf -m prep SDfile
Find this compound or compounds like it in BindingDB:
Activity Spreadsheet -- Enzyme Inhibition Constant Data from BindingDB
Found 1 hit for monomerid = 127955
TargetTyrosine-protein kinase SYK(Homo sapiens (Human))
Merck Sharp & Dohme
US Patent
LigandPNGBDBM127955(US8796310, 4B)
Affinity DataIC50:  2.36nMpH: 7.5Assay Description:A recombinant GST-hSyk fusion protein was used to measure potency of compounds to inhibit human Syk activity. The recombinant human GST-Syk (Cama Bio...
In DepthDetails US Patent