BDBM128284 US8796295, Table 2: Compound: 8
SMILES COc1cccc(NC(=O)c2cc(Cl)cc(Oc3cncnc3)c2)n1
InChI Key InChIKey=ABUZOTKQQBPGAC-UHFFFAOYSA-N
Data  2 IC50
  Tab Delimited (TSV)   2D SDfile   Computed 3D by Vconf -m prep SDfile
Find this compound or compounds like it in BindingDB:
Activity Spreadsheet -- Enzyme Inhibition Constant Data from BindingDB
Found 2 hits for monomerid = 128284
TargetMetabotropic glutamate receptor 5(Homo sapiens (Human))
Vanderbilt University
US Patent
LigandPNGBDBM128284(US8796295, Table 2: Compound: 8)
Affinity DataIC50:  51nM. Assay description: The utility of the compounds in accordance with the present invention as negative allosteric modulators of metabotropic glutamate receptor activity, ...
In DepthDetails US Patent
TargetMetabotropic glutamate receptor 5(Rattus norvegicus (Rat))
Vanderbilt University
US Patent
LigandPNGBDBM128284(US8796295, Table 2: Compound: 8)
Affinity DataIC50:  65nM. Assay description: The utility of the compounds in accordance with the present invention as negative allosteric modulators of metabotropic glutamate receptor activity, ...
In DepthDetails US Patent