BDBM128648 US8796244, 237
SMILES Cc1cc(nc(n1)C(F)(F)F)-c1ccn2c(cnc2c1)-c1cccc(NC(=O)NCC(F)(F)F)c1
InChI Key InChIKey=IOICYHRUOYDZIR-UHFFFAOYSA-N
Data  2 IC50
  Tab Delimited (TSV)   2D SDfile   Computed 3D by Vconf -m prep SDfile
Find this compound or compounds like it in BindingDB:
Activity Spreadsheet -- Enzyme Inhibition Constant Data from BindingDB
Found 2 hits for monomerid = 128648
TargetVascular endothelial growth factor receptor 2(Homo sapiens (Human))
Astex Therapeutics
US Patent
LigandPNGBDBM128648(US8796244, 237)
Affinity DataIC50:  160nMpH: 8.0 T: 2°C. Assay description: VEGFR2 (from Upstate), prepared at 2x final concentration, was incubated with test compounds, biotinylated Flt3 substrate (biotin-VASSDNEYFYVDF) (Cel...
In DepthDetails US Patent
TargetFibroblast growth factor receptor 3(Homo sapiens (Human))
Astex Therapeutics
US Patent
LigandPNGBDBM128648(US8796244, 237)
Affinity DataIC50:  11nMpH: 8.0 T: 2°C. Assay description: Enzymes (from Upstate) were prepared at 2× final concentration in 1× kinase assay buffer (Table 1). Enzymes were then incubated with test compounds, ...
In DepthDetails US Patent