BDBM12876 (5S)-3-(3,4-difluorophenyl)-N-[(2S,3R)-3-hydroxy-4-[(4-methoxybenzene)(2-methylpropyl)sulfonamido]-1-phenylbutan-2-yl]-2-oxo-1,3-oxazolidine-5-carboxamide::(5S)-N-[(1S,2R)-1-Benzyl-2-hydroxy-3-[isobutyl[(4-methoxy-phenyl)sulfonyl]amino]propyl]-3-(3,4-difluorophenyl)-2-oxooxazolidinone5-carboxamide::N-Aryl-oxazolidinone-5-carboxamide Analogue 21c
SMILES COc1ccc(cc1)S(=O)(=O)N(CC(C)C)C[C@@H](O)[C@H](Cc1ccccc1)NC(=O)[C@@H]1CN(C(=O)O1)c1ccc(F)c(F)c1
InChI Key InChIKey=LAEBWIYUPGQNFS-NHKHRBQYSA-N
Data  6 KI
  Tab Delimited (TSV)   2D SDfile   Computed 3D by Vconf -m prep SDfile
Find this compound or compounds like it in BindingDB:
Activity Spreadsheet -- Enzyme Inhibition Constant Data from BindingDB
Found 6 hits for monomerid = 12876
TargetDimer of Gag-Pol polyprotein [491-589,Q496K](Human immunodeficiency virus type 1)
University Of Massachusetts Medical School
LigandPNGBDBM12876((5S)-3-(3,4-difluorophenyl)-N-[(2S,3R)-3-hydroxy-4...)
Affinity DataKi:  0.0660nM ΔG°:  -14.1kcal/molepH: 4.7 T: 2°C. Assay description: HIV-1 protease inhibitor activities were determined by the fluorescence resonance energy transfer (FRET) method. The energy transfer donor (EDANS) an...
In DepthDetails ArticlePubMed
TargetHIV-1 protease(Human immunodeficiency virus)
Umbi
Curated by ChEMBL
LigandPNGBDBM12876((5S)-3-(3,4-difluorophenyl)-N-[(2S,3R)-3-hydroxy-4...)
Affinity DataKi:  0.0660nM. Assay description: Inhibition of HIV1 protease Q7K mutant by FRET method
In DepthDetails ArticlePubMed
TargetHIV-1 protease(Human immunodeficiency virus)
Umbi
Curated by ChEMBL
LigandPNGBDBM12876((5S)-3-(3,4-difluorophenyl)-N-[(2S,3R)-3-hydroxy-4...)
Affinity DataKi:  0.0661nM. Assay description: Inhibition of HIV1 protease Q7K mutant by FRET method
In DepthDetails ArticlePubMed
TargetDimer of Gag-Pol polyprotein [491-589,Q498K,D521N,V555I,N579D](Human immunodeficiency virus type 1)
University Of Massachusetts Medical School
LigandPNGBDBM12876((5S)-3-(3,4-difluorophenyl)-N-[(2S,3R)-3-hydroxy-4...)
Affinity DataKi:  0.152nM ΔG°:  -13.6kcal/molepH: 4.7 T: 2°C. Assay description: HIV-1 protease inhibitor activities were determined by the fluorescence resonance energy transfer (FRET) method. The energy transfer donor (EDANS) an...
In DepthDetails ArticlePubMed
TargetDimer of Gag-Pol polyprotein [491-589,Q498K,L501I,G539V,I545V,V555I,V573A](Human immunodeficiency virus type 1)
University Of Massachusetts Medical School
LigandPNGBDBM12876((5S)-3-(3,4-difluorophenyl)-N-[(2S,3R)-3-hydroxy-4...)
Affinity DataKi:  1.18nM ΔG°:  -12.4kcal/molepH: 4.7 T: 2°C. Assay description: HIV-1 protease inhibitor activities were determined by the fluorescence resonance energy transfer (FRET) method. The energy transfer donor (EDANS) an...
In DepthDetails ArticlePubMed
TargetDimer of Gag-Pol polyprotein [491-589,Q498K,L501I,V555I,A562V,G564S,I575V,L581M](Human immunodeficiency virus type 1)
University Of Massachusetts Medical School
LigandPNGBDBM12876((5S)-3-(3,4-difluorophenyl)-N-[(2S,3R)-3-hydroxy-4...)
Affinity DataKi:  8.69nM ΔG°:  -11.2kcal/molepH: 4.7 T: 2°C. Assay description: HIV-1 protease inhibitor activities were determined by the fluorescence resonance energy transfer (FRET) method. The energy transfer donor (EDANS) an...
In DepthDetails ArticlePubMed