BDBM129023 US8802674, 40
SMILES CNc1nc(Nc2ccc(cc2OC)C(=O)N2CCOCC2CO)ncc1Cl
InChI Key InChIKey=XFIPGXQDRJTXLZ-UHFFFAOYSA-N
Data  1 KI
  Tab Delimited (TSV)   2D SDfile   Computed 3D by Vconf -m prep SDfile
Find this compound or compounds like it in BindingDB:
Activity Spreadsheet -- Enzyme Inhibition Constant Data from BindingDB
Found 1 hit for monomerid = 129023
TargetLeucine-rich repeat serine/threonine-protein kinase 2(Homo sapiens (Human))
Genentech
US Patent
LigandPNGBDBM129023(US8802674, 40)
Affinity DataKi:  4.40nM. Assay description: This assay was used to determine a compound's potency in inhibiting activity of LRRK2 by determining, Kiapp, IC50, or percent inhibition values. ...
In DepthDetails US Patent