BDBM129035 US8802674, 67
SMILES COc1cc(ccc1Nc1ncc(Cl)c(NCC(C)C)n1)C(=O)N1CCOCC1
InChI Key InChIKey=RUIBQYIWOSJHHQ-UHFFFAOYSA-N
Data  1 KI
  Tab Delimited (TSV)   2D SDfile   Computed 3D by Vconf -m prep SDfile
Find this compound or compounds like it in BindingDB:
Activity Spreadsheet -- Enzyme Inhibition Constant Data from BindingDB
Found 1 hit for monomerid = 129035
TargetLeucine-rich repeat serine/threonine-protein kinase 2(Homo sapiens (Human))
Genentech
US Patent
LigandPNGBDBM129035(US8802674, 67)
Affinity DataKi:  4nM. Assay description: This assay was used to determine a compound's potency in inhibiting activity of LRRK2 by determining, Kiapp, IC50, or percent inhibition values. ...
In DepthDetails US Patent