BDBM12904 (5S)-N-[(1S,2R)-1-Benzyl-3-[(cyclopropylmethyl)[(4-methoxy-phenyl)sulfonyl]amino]-2 hydroxypropyl]-3-(3-fluorophenyl)-2-oxooxazolidine-5-carboxamide::(5S)-N-[(2S,3R)-4-[(cyclopropylmethyl)(4-methoxybenzene)sulfonamido]-3-hydroxy-1-phenylbutan-2-yl]-3-(3-fluorophenyl)-2-oxo-1,3-oxazolidine-5-carboxamide::N-Aryl-oxazolidinone-5-carboxamide Analogue 36b
SMILES COc1ccc(cc1)S(=O)(=O)N(C[C@@H](O)[C@H](Cc1ccccc1)NC(=O)[C@@H]1CN(C(=O)O1)c1cccc(F)c1)CC1CC1
InChI Key InChIKey=XETSHCIFFATMOX-NHKHRBQYSA-N
Data  3 KI
  Tab Delimited (TSV)   2D SDfile   Computed 3D by Vconf -m prep SDfile
Find this compound or compounds like it in BindingDB:
Activity Spreadsheet -- Enzyme Inhibition Constant Data from BindingDB
Found 3 hits for monomerid = 12904
TargetDimer of Gag-Pol polyprotein [491-589,Q496K](Human immunodeficiency virus type 1)
University Of Massachusetts Medical School
LigandPNGBDBM12904((5S)-N-[(1S,2R)-1-Benzyl-3-[(cyclopropylmethyl)[(4...)
Affinity DataKi:  0.257nM. Assay description: HIV-1 protease inhibitor activities were determined by the fluorescence resonance energy transfer (FRET) method. The energy transfer donor (EDANS) an...
In DepthDetails ArticlePubMed
TargetHIV-1 protease(Human immunodeficiency virus)
Umbi
Curated by ChEMBL
LigandPNGBDBM12904((5S)-N-[(1S,2R)-1-Benzyl-3-[(cyclopropylmethyl)[(4...)
Affinity DataKi:  0.257nM. Assay description: Inhibition of HIV1 protease Q7K mutant by FRET method
In DepthDetails ArticlePubMed
TargetHIV-1 protease(Human immunodeficiency virus)
Umbi
Curated by ChEMBL
LigandPNGBDBM12904((5S)-N-[(1S,2R)-1-Benzyl-3-[(cyclopropylmethyl)[(4...)
Affinity DataKi:  0.257nM. Assay description: Inhibition of HIV1 protease Q7K mutant by FRET method
In DepthDetails ArticlePubMed