BDBM129058 US8802674, 104
SMILES COc1cc(ccc1Nc1ncc(Cl)c(NCCC2CC2)n1)C(=O)N1CCOCC1
InChI Key InChIKey=BAFGTAQHMVTSRT-UHFFFAOYSA-N
Data  1 KI
  Tab Delimited (TSV)   2D SDfile   Computed 3D by Vconf -m prep SDfile
Find this compound or compounds like it in BindingDB:
Activity Spreadsheet -- Enzyme Inhibition Constant Data from BindingDB
Found 1 hit for monomerid = 129058
TargetLeucine-rich repeat serine/threonine-protein kinase 2(Homo sapiens (Human))
Genentech
US Patent
LigandPNGBDBM129058(US8802674, 104)
Affinity DataKi:  1.80nM. Assay description: This assay was used to determine a compound's potency in inhibiting activity of LRRK2 by determining, Kiapp, IC50, or percent inhibition values. ...
In DepthDetails US Patent