BDBM129092 US8802674, 176
SMILES CNc1nc(Nc2cc(OC)c(cc2Cl)C(=O)N2CCNCC2)ncc1C(F)(F)F
InChI Key InChIKey=GWLYBYJENNGYNK-UHFFFAOYSA-N
Data  1 KI
  Tab Delimited (TSV)   2D SDfile   Computed 3D by Vconf -m prep SDfile
Find this compound or compounds like it in BindingDB:
Activity Spreadsheet -- Enzyme Inhibition Constant Data from BindingDB
Found 1 hit for monomerid = 129092
TargetLeucine-rich repeat serine/threonine-protein kinase 2(Homo sapiens (Human))
Genentech
US Patent
LigandPNGBDBM129092(US8802674, 176)
Affinity DataKi:  4.10nM. Assay description: This assay was used to determine a compound's potency in inhibiting activity of LRRK2 by determining, Kiapp, IC50, or percent inhibition values. ...
In DepthDetails US Patent