BDBM129226 US8815951, 514
SMILES CCCCCCCCCCCCNC(=O)CC1CCCCC1
InChI Key InChIKey=QERTYZJJDCQJGI-UHFFFAOYSA-N
Data  1 IC50
  Tab Delimited (TSV)   2D SDfile   Computed 3D by Vconf -m prep SDfile
Find this compound or compounds like it in BindingDB:
Activity Spreadsheet -- Enzyme Inhibition Constant Data from BindingDB
Found 1 hit for monomerid = 129226
TargetEpoxide hydrolase 1(Mus musculus (Mouse))
The Regents Of The University Of California
US Patent
LigandPNGBDBM129226(US8815951, 514)
Affinity DataIC50:  270nM. Assay description: The invention also provide methods for assaying for epoxide hydrolase activity as diagnostic assay to identify individuals at increased risk for hype...
In DepthDetails US Patent