BDBM129234 US8815951, 157
SMILES CCCCCCNC(=O)Nc1ccccc1
InChI Key InChIKey=MRZIEGTYOBOCLG-UHFFFAOYSA-N
Data  2 IC50
  Tab Delimited (TSV)   2D SDfile   Computed 3D by Vconf -m prep SDfile
Find this compound or compounds like it in BindingDB:
Activity Spreadsheet -- Enzyme Inhibition Constant Data from BindingDB
Found 2 hits for monomerid = 129234
TargetEpoxide hydrolase 1(Homo sapiens (Human))
The Regents Of The University Of California
US Patent
LigandPNGBDBM129234(US8815951, 157)
Affinity DataIC50:  1.43E+3nM. Assay description: The invention also provide methods for assaying for epoxide hydrolase activity as diagnostic assay to identify individuals at increased risk for hype...
In DepthDetails US Patent
TargetEpoxide hydrolase 1(Mus musculus (Mouse))
The Regents Of The University Of California
US Patent
LigandPNGBDBM129234(US8815951, 157)
Affinity DataIC50:  850nM. Assay description: The invention also provide methods for assaying for epoxide hydrolase activity as diagnostic assay to identify individuals at increased risk for hype...
In DepthDetails US Patent