BDBM129384 US8802673, 26
SMILES Clc1ccc2nc(Nc3ccc(cc3)[C@H]3CNCCO3)sc2c1
InChI Key InChIKey=BAOBADUPYUALTB-OAHLLOKOSA-N
Data  2 KI
  Tab Delimited (TSV)   2D SDfile   Computed 3D by Vconf -m prep SDfile
Find this compound or compounds like it in BindingDB:
Activity Spreadsheet -- Enzyme Inhibition Constant Data from BindingDB
Found 2 hits for monomerid = 129384
TargetTrace amine-associated receptor 1(Mus musculus (Mouse))
Hoffmann-La Roche
US Patent
LigandPNGBDBM129384(US8802673, 26)
Affinity DataKi:  2nM ΔG°:  -12.3kcal/molepH: 7.4 T: 2°C. Assay description: HEK-293 cells stably expressing rat TAAR1 were maintained at 37 C. and 5% CO2 in DMEM high glucose medium, containing fetal calf serum (10%, heat ina...
Ligand InfoPC cidPC sid
In DepthDetails US Patent
TargetTrace amine-associated receptor 7b(Rattus norvegicus (Rat))
Hoffmann-La Roche
US Patent
LigandPNGBDBM129384(US8802673, 26)
Affinity DataKi:  8.30nM ΔG°:  -11.5kcal/molepH: 7.4 T: 2°C. Assay description: HEK-293 cells stably expressing mouse TAAR1 were maintained at 37 C. and 5% CO2 in DMEM high glucose medium, containing fetal calf serum (10%, heat i...
Ligand InfoPC cidPC sid
In DepthDetails US Patent