BDBM129542 US8802673, 184
SMILES FC(F)(F)COc1cnc(Nc2ccc(cc2Cl)C2CNCCO2)nc1
InChI Key InChIKey=GKZIIVLHQPGYIY-UHFFFAOYSA-N
Data  2 KI
  Tab Delimited (TSV)   2D SDfile   Computed 3D by Vconf -m prep SDfile
Find this compound or compounds like it in BindingDB:
Activity Spreadsheet -- Enzyme Inhibition Constant Data from BindingDB
Found 2 hits for monomerid = 129542
TargetTrace amine-associated receptor 7b(Rattus norvegicus (Rat))
Hoffmann-La Roche
US Patent
LigandPNGBDBM129542(US8802673, 184)
Affinity DataKi:  2nM ΔG°:  -12.3kcal/molepH: 7.4 T: 2°C. Assay description: HEK-293 cells stably expressing mouse TAAR1 were maintained at 37 C. and 5% CO2 in DMEM high glucose medium, containing fetal calf serum (10%, heat i...
In DepthDetails US Patent
TargetTrace amine-associated receptor 1(Mus musculus (Mouse))
Hoffmann-La Roche
US Patent
LigandPNGBDBM129542(US8802673, 184)
Affinity DataKi:  2nM ΔG°:  -12.3kcal/molepH: 7.4 T: 2°C. Assay description: HEK-293 cells stably expressing rat TAAR1 were maintained at 37 C. and 5% CO2 in DMEM high glucose medium, containing fetal calf serum (10%, heat ina...
In DepthDetails US Patent