BDBM13001 5-Chloro-N-({(5R)-2-oxo-3-[4-(3-oxomorpholin-4-yl)phenyl]-1,3-oxazolidin-5-yl}methyl)thiophene-2-carboxamide::5-chloro-N-{[(5R)-2-oxo-3-[4-(3-oxomorpholin-4-yl)phenyl]-1,3-oxazolidin-5-yl]methyl}thiophene-2-carboxamide::BAY 59-7939 Analog 16
SMILES Clc1ccc(s1)C(=O)NC[C@@H]1CN(C(=O)O1)c1ccc(cc1)N1CCOCC1=O
InChI Key InChIKey=KGFYHTZWPPHNLQ-CQSZACIVSA-N
Data  1 IC50
  Tab Delimited (TSV)   2D SDfile   Computed 3D by Vconf -m prep SDfile
Find this compound or compounds like it in BindingDB:
Activity Spreadsheet -- Enzyme Inhibition Constant Data from BindingDB
Found 1 hit for monomerid = 13001
TargetCoagulation factor X(Homo sapiens (Human))
Bayer Healthcare
LigandPNGBDBM13001(5-Chloro-N-({(5R)-2-oxo-3-[4-(3-oxomorpholin-4-yl)...)
Affinity DataIC50:  2.30E+3nMpH: 8.3 T: 2°C. Assay description: The enzymatic activity was measured using chromogenic or fluorogenic substrates in 96-well microtiter plates.Color change was monitored continuously ...
In DepthDetails ArticlePubMed