BDBM130691 US8829200, 28
SMILES CC(C)(C)n1c(nc2cc(ccc12)-c1cnc(N)nc1)-c1ccccc1C(=O)N1CCOCC1
InChI Key InChIKey=BMKQQLOHUPSGER-UHFFFAOYSA-N
Data  1 IC50
  Tab Delimited (TSV)   2D SDfile   Computed 3D by Vconf -m prep SDfile
Find this compound or compounds like it in BindingDB:
Activity Spreadsheet -- Enzyme Inhibition Constant Data from BindingDB
Found 1 hit for monomerid = 130691
TargetArachidonate 5-lipoxygenase-activating protein(Homo sapiens (Human))
Boehringer Ingelheim International
US Patent
LigandPNGBDBM130691(US8829200, 28)
Affinity DataIC50:  520nMT: 2°C. Assay description: Compounds are assessed for the ability to bind to FLAP in a binding assay that measures compound-specific displacement of an iodinated (125I) FLAP in...
In DepthDetails US Patent