BDBM130849 US8829199, 239
SMILES Cc1nc2ccc(cc2n1)-n1ncc(C(=O)c2cc3cc(ccc3[nH]2)C(=O)N2CC[C@H](F)C2)c1N
InChI Key InChIKey=BMQKRSZIBFNLAW-INIZCTEOSA-N
Data  3 IC50
  Tab Delimited (TSV)   2D SDfile   Computed 3D by Vconf -m prep SDfile
Find this compound or compounds like it in BindingDB:
Activity Spreadsheet -- Enzyme Inhibition Constant Data from BindingDB
Found 3 hits for monomerid = 130849
TargetFibroblast growth factor receptor 3(Homo sapiens (Human))
Chugai Seiyaku Kabushiki Kaisha
US Patent
LigandPNGBDBM130849(US8829199, 239)
Affinity DataIC50:  4.00E+3nM. Assay description: The FGFR3-inhibiting activity was measured based on the activity to inhibit phosphorylation of the biotinylated peptide EGPWLEEEEEAYGWMDF by the huma...
In DepthDetails US Patent
TargetFibroblast growth factor receptor 2(Homo sapiens (Human))
Chugai Seiyaku Kabushiki Kaisha
US Patent
LigandPNGBDBM130849(US8829199, 239)
Affinity DataIC50:  538nM. Assay description: The FGFR2-inhibiting activity was measured based on the activity to inhibit phosphorylation of the biotinylated peptide EGPWLEEEEEAYGWMDF by the huma...
In DepthDetails US Patent
TargetFibroblast growth factor receptor 1(Homo sapiens (Human))
Chugai Seiyaku Kabushiki Kaisha
US Patent
LigandPNGBDBM130849(US8829199, 239)
Affinity DataIC50:  2.80E+3nM. Assay description: The FGFR1-inhibiting activity was measured based on the activity to inhibit phosphorylation of the biotinylated peptide EGPWLEEEEEAYGWMDF by the huma...
In DepthDetails US Patent