BDBM130990 US8829010, 41
SMILES Cn1ncc(-c2nn(C)c3ncnc(N4CCC4)c23)c1-c1ccc(CBr)cc1
InChI Key InChIKey=PSJQJUANSGSYBQ-UHFFFAOYSA-N
Data  1 IC50
  Tab Delimited (TSV)   2D SDfile   Computed 3D by Vconf -m prep SDfile
Find this compound or compounds like it in BindingDB:
Activity Spreadsheet -- Enzyme Inhibition Constant Data from BindingDB
Found 1 hit for monomerid = 130990
TargetcGMP-dependent 3',5'-cyclic phosphodiesterase(Homo sapiens (Human))
Pfizer
US Patent
LigandPNGBDBM130990(US8829010, 41)
Affinity DataIC50:  4.20nM. Assay description: In the present assay, the activity of the test substances on human full-length PDE2A3 enzyme was determined using the [3H]-cGMP scintillation proximi...
In DepthDetails US Patent