BDBM131047 US8835472, 1.12
SMILES CC(Cc1ccc(cc1)C#Cc1ccc(cc1)C(=O)NCc1ccccc1)NC(C)=O
InChI Key InChIKey=BXODKVXVLIPDMC-UHFFFAOYSA-N
Data  1 IC50
  Tab Delimited (TSV)   2D SDfile   Computed 3D by Vconf -m prep SDfile
Find this compound or compounds like it in BindingDB:
Activity Spreadsheet -- Enzyme Inhibition Constant Data from BindingDB
Found 1 hit for monomerid = 131047
TargetAcetyl-CoA carboxylase 2(Homo sapiens (Human))
Boehringer Ingelheim International
US Patent
LigandPNGBDBM131047(US8835472, 1.12)
Affinity DataIC50:  2.30E+3nMpH: 7.5Assay Description:Malonyl CoA formation by acetyl CoA carboxylases is stoichometrically linked to the consumption of ATP. ACC2 activity is measured in a NADH-linked ki...
In DepthDetails US Patent