BDBM13110 CGS 27023A Analog 38::N-hydroxy-2-[(4-methoxybenzene)[2-(piperidin-1-yl)ethyl]sulfonamido]acetamide
SMILES COc1ccc(cc1)S(=O)(=O)N(CCN1CCCCC1)CC(=O)NO
InChI Key InChIKey=YEHKZVNFGURGEX-UHFFFAOYSA-N
Data  1 KI
  Tab Delimited (TSV)   2D SDfile   Computed 3D by Vconf -m prep SDfile
Find this compound or compounds like it in BindingDB:
Activity Spreadsheet -- Enzyme Inhibition Constant Data from BindingDB
Found 1 hit for monomerid = 13110
TargetStromelysin-1(Homo sapiens (Human))
Novartis Pharmaceuticals
LigandPNGBDBM13110(CGS 27023A Analog 38 | N-hydroxy-2-[(4-methoxybenz...)
Affinity DataKi:  1.13E+3nM. Assay description: Stromelysin inhibitory activity is based on the hydrolysis of substance P by recombinant human stromelysin to generate a fragment, substance P 7-11, ...
In DepthDetails ArticlePubMed