BDBM13150 (2S)-1-[(2S)-2-[(2S)-2-aminopropanamido]-3-methylbutanoyl]-N-(2-phenylethyl)pyrrolidine-2-carboxamide::Smac peptido-mimetic 6h
SMILES CC(C)[C@H](NC(=O)[C@H](C)N)C(=O)N1CCC[C@H]1C(=O)NCCc1ccccc1
InChI Key InChIKey=ZVSVRPUZPIDLBB-SZMVWBNQSA-N
Data  1 KI
  Tab Delimited (TSV)   2D SDfile   Computed 3D by Vconf -m prep SDfile
Find this compound or compounds like it in BindingDB:
Activity Spreadsheet -- Enzyme Inhibition Constant Data from BindingDB
Found 1 hit for monomerid = 13150
TargetE3 ubiquitin-protein ligase XIAP [241-356](Homo sapiens (Human))
University Of Michigan
LigandPNGBDBM13150((2S)-1-[(2S)-2-[(2S)-2-aminopropanamido]-3-methylb...)
Affinity DataKi:  150nM ΔG°:  -9.21kcal/molepH: 7.5 T: 2°C. Assay description: A quantitative in vitro binding assay using the fluorescence polarization (FP) based method was developed and used to determine the binding affinity ...
In DepthDetails ArticlePubMed