BDBM13176 (2S,4S)-1-[(2S)-2-cyclohexyl-2-[(2S)-2-(methylamino)propanamido]acetyl]-4-phenoxy-N-[(1R)-1,2,3,4-tetrahydronaphthalen-1-yl]pyrrolidine-2-carboxamide::Capped Tripeptide Analog 12::H-N-Me-Ala-Chg-(4S)-4-phenoxy-Pro-(R)-tetrahydronaphth-1-yl Amide
SMILES CN[C@@H](C)C(=O)N[C@@H](C1CCCCC1)C(=O)N1C[C@H](C[C@H]1C(=O)N[C@@H]1CCCc2ccccc12)Oc1ccccc1
InChI Key InChIKey=GUOVHJVNYPRNQS-SHUILBLCSA-N
Data  1 Kd
  Tab Delimited (TSV)   2D SDfile   Computed 3D by Vconf -m prep SDfile
Find this compound or compounds like it in BindingDB:
Activity Spreadsheet -- Enzyme Inhibition Constant Data from BindingDB
Found 1 hit for monomerid = 13176
TargetE3 ubiquitin-protein ligase XIAP [241-356](Homo sapiens (Human))
Abbott Laboratories
LigandPNGBDBM13176((2S,4S)-1-[(2S)-2-cyclohexyl-2-[(2S)-2-(methylamin...)
Affinity DataKd:  6nMpH: 7.4 T: 2°C. Assay description: A fluorescence polarization anisotropy (FPA) competition assay was used to determine the affinities of compounds to BIR3 protein. Fluorescence polari...
In DepthDetails ArticlePubMed