BDBM131846 US8835445, 24
SMILES COc1cc2n(c(nc2cc1CO)-c1nccs1)-c1cc2nc(N)nc(N)c2cc1C
InChI Key InChIKey=KDHIRSJXSHFBMF-UHFFFAOYSA-N
Data  2 KI
  Tab Delimited (TSV)   2D SDfile   Computed 3D by Vconf -m prep SDfile
Find this compound or compounds like it in BindingDB:
Activity Spreadsheet -- Enzyme Inhibition Constant Data from BindingDB
Found 2 hits for monomerid = 131846
TargetDihydrofolate reductase(Staphylococcus aureus)
Trius Therapeutics
US Patent
LigandPNGBDBM131846(US8835445, 24)
Affinity DataKi:  0.0190nM. Assay description: Antibacterial activity as measured by the minimal inhibitory concentrations (MIC) and minimal bactericidal concentrations of compounds are well known...
In DepthDetails US Patent
TargetDihydrofolate reductase(Homo sapiens (Human))
Trius Therapeutics
US Patent
LigandPNGBDBM131846(US8835445, 24)
Affinity DataKi:  170nM. Assay description: Antibacterial activity as measured by the minimal inhibitory concentrations (MIC) and minimal bactericidal concentrations of compounds are well known...
In DepthDetails US Patent