BDBM13210 (3S,6S,8aS)-6-[(2S)-2-aminobutanamido]-N-(diphenylmethyl)-5-oxo-octahydroindolizine-3-carboxamide::JMC517169 Compound 10::Smac AVPI Mimetic 12d
SMILES CC[C@H](N)C(=O)N[C@H]1CC[C@H]2CC[C@H](N2C1=O)C(=O)NC(c1ccccc1)c1ccccc1
InChI Key InChIKey=VWDMCRIMEONDMI-CMOCDZPBSA-N
Data  2 KI
  Tab Delimited (TSV)   2D SDfile   Computed 3D by Vconf -m prep SDfile
Find this compound or compounds like it in BindingDB:
Activity Spreadsheet -- Enzyme Inhibition Constant Data from BindingDB
Found 2 hits for monomerid = 13210
TargetE3 ubiquitin-protein ligase XIAP [241-356](Homo sapiens (Human))
University Of Michigan
LigandPNGBDBM13210((3S,6S,8aS)-6-[(2S)-2-aminobutanamido]-N-(diphenyl...)
Affinity DataKi:  350nM ΔG°:  -8.71kcal/molepH: 7.5 T: 2°C. Assay description: Fluorescence polarization was measured on an Ultra plate reader at excitation and emission wavelengths of 485 and 530 nm, respectively. The equilibri...
In DepthDetails ArticlePubMed
TargetE3 ubiquitin-protein ligase XIAP [241-356](Homo sapiens (Human))
University Of Michigan
LigandPNGBDBM13210((3S,6S,8aS)-6-[(2S)-2-aminobutanamido]-N-(diphenyl...)
Affinity DataKi:  350nM ΔG°:  -8.71kcal/molepH: 7.5 T: 2°C. Assay description: A quantitative in vitro binding assay using the fluorescence polarization (FP) based method was developed and used to determine the binding affinity ...
In DepthDetails ArticlePubMed