BDBM132147 USRE45173, 86A
SMILES Cc1ccncc1N1CCN(C1=O)c1cccc(Cl)c1F
InChI Key InChIKey=OSAUEPXGUASKDP-UHFFFAOYSA-N
Data  1 IC50
  Tab Delimited (TSV)   2D SDfile   Computed 3D by Vconf -m prep SDfile
Find this compound or compounds like it in BindingDB:
Activity Spreadsheet -- Enzyme Inhibition Constant Data from BindingDB
Found 1 hit for monomerid = 132147
TargetSteroid 17-alpha-hydroxylase/17,20 lyase(Homo sapiens (Human))
Novartis
US Patent
LigandPNGBDBM132147(USRE45173, 86A)
Affinity DataIC50:  1.20E+3nM. Assay description: Cytochrome P450, 17-20 lyase (CYP17-lyase) assay development using recombinant human CYP17 enzyme and 17-alpha -hydroxy pregnenolone [21-3H] as the s...
In DepthDetails US Patent