BDBM132637 US8841312, 387
SMILES C[C@H](CO)n1c2cnccc2c2cnc(Nc3ccc(nn3)N3CCN[C@@H](C)C3)nc12
InChI Key InChIKey=UTIZBDAJXMEQEK-UONOGXRCSA-N
Data  1 IC50
  Tab Delimited (TSV)   2D SDfile   Computed 3D by Vconf -m prep SDfile
Find this compound or compounds like it in BindingDB:
Activity Spreadsheet -- Enzyme Inhibition Constant Data from BindingDB
Found 1 hit for monomerid = 132637
TargetCyclin-dependent kinase 4(Homo sapiens (Human))
Amgen
US Patent
LigandPNGBDBM132637(US8841312, 387)
Affinity DataIC50:  227nMpH: 7.4 T: 2°C. Assay description: The Cdk4 and Cdk6 inhibitory activity of the compounds is measured with a kinase inhibition assay using recombinant Cdk4/CyclinD1 or Cdk6/CyclinD3 pr...
In DepthDetails US Patent