BDBM133079 US8846746, 385
SMILES CCCc1cccc(c1)-c1cc(NC(=O)[C@H]2CNC(=O)N2CC(F)(F)F)nn1-c1ccccc1
InChI Key InChIKey=RGZURFZKJYWSDN-HXUWFJFHSA-N
Data  1 IC50
  Tab Delimited (TSV)   2D SDfile   Computed 3D by Vconf -m prep SDfile
Find this compound or compounds like it in BindingDB:
Activity Spreadsheet -- Enzyme Inhibition Constant Data from BindingDB
Found 1 hit for monomerid = 133079
TargetSodium/glucose cotransporter 1(Homo sapiens (Human))
Japan Tobacco
US Patent
LigandPNGBDBM133079(US8846746, 385)
Affinity DataIC50:  7nMT: 2°C. Assay description: The stable cell line expressing human SGLT1 was seeded at 5x104 cells/well on BioCoat Poly-D-Lysine 96 well plate with Lid (Becton Dickinson and Comp...
In DepthDetails US Patent