BDBM133297 US8846730, 54
SMILES CN1C[C@H](F)C[C@H]1COc1ccc(cc1C(=O)\N=c1/sc(cn1C[C@H]1CCCO1)C(C)(C)C)C(F)(F)F
InChI Key InChIKey=NZYBJQJYFGAOPV-FXUUATLASA-N
Data  2 KI
  Tab Delimited (TSV)   2D SDfile   Computed 3D by Vconf -m prep SDfile
Find this compound or compounds like it in BindingDB:
Activity Spreadsheet -- Enzyme Inhibition Constant Data from BindingDB
Found 2 hits for monomerid = 133297
TargetCannabinoid receptor 2(Rattus norvegicus (Rat))
Abbvie
US Patent
LigandPNGBDBM133297(US8846730, 54)
Affinity DataKi:  1.5nM ΔG°:  -12.2kcal/molepH: 7.4 T: 2°C. Assay description: HEK293 cells stably expressing human CB2 receptors were grown until a confluent monolayer was formed. Briefly, the cells were harvested and homogeniz...
In DepthDetails US Patent
TargetCannabinoid receptor 2(Homo sapiens (Human))
Abbvie
US Patent
LigandPNGBDBM133297(US8846730, 54)
Affinity DataKi:  2nM ΔG°:  -12.1kcal/molepH: 7.4 T: 2°C. Assay description: HEK293 cells stably expressing human CB2 receptors were grown until a confluent monolayer was formed. Briefly, the cells were harvested and homogeniz...
In DepthDetails US Patent